Target
Platelet-derived growth factor receptor beta
Ligand
BDBM50132203
Substrate
Meas. Tech.
ChEBML_158518
IC50
>30000±n/a nM
Citation
 Matsuno, KSeishi, TNakajima, TIchimura, MGiese, NAYu, JCOda, SNomoto, Y Potent and selective inhibitors of platelet-derived growth factor receptor phosphorylation. Part 4: structure-activity relationships for substituents on the quinazoline moiety of 4-[4-(N-substituted(thio)carbamoyl)-1-piperazinyl]-6,7-dimethoxyquinazoline derivatives. Bioorg Med Chem Lett 13:3001-4 (2003)  
Target
Name:
Platelet-derived growth factor receptor beta
Synonyms:
Beta-type platelet-derived growth factor receptor CD140b antigen PDGF Receptor Substrate PDGFR PDGFR-1 PDGFRB PGFRB_HUMAN Platelet-derived growth factor receptor 1 Platelet-derived growth factor receptor beta (PDGFR-beta) Platelet-derived growth factor receptor beta (PDGFRbeta) | VHL/PDGFRB
Type:
Enzyme
Mol. Mass.:
123922.25
Organism:
Homo sapiens (Human)
Description:
P09619
Residue:
1106
  
Inhibitor
Name:
BDBM50132203
Synonyms:
4-(2-Chloro-6,7-dimethoxy-quinazolin-4-yl)-piperazine-1-carboxylic acid (4-phenoxy-phenyl)-amide | CHEMBL103326
Type:
Small organic molecule
Emp. Form.:
C27H26ClN5O4
Mol. Mass.:
519.979
SMILES:
COc1cc2nc(Cl)nc(N3CCN(CC3)C(=O)Nc3ccc(Oc4ccccc4)cc3)c2cc1OC
: