Target
Platelet-derived growth factor receptor beta
Ligand
BDBM50132229
Substrate
Meas. Tech.
ChEBML_158518
IC50
>100.0±n/a nM
Citation
 Matsuno, KSeishi, TNakajima, TIchimura, MGiese, NAYu, JCOda, SNomoto, Y Potent and selective inhibitors of platelet-derived growth factor receptor phosphorylation. Part 4: structure-activity relationships for substituents on the quinazoline moiety of 4-[4-(N-substituted(thio)carbamoyl)-1-piperazinyl]-6,7-dimethoxyquinazoline derivatives. Bioorg Med Chem Lett 13:3001-4 (2003)  
Target
Name:
Platelet-derived growth factor receptor beta
Synonyms:
Beta-type platelet-derived growth factor receptor CD140b antigen PDGF Receptor Substrate PDGFR PDGFR-1 PDGFRB PGFRB_HUMAN Platelet-derived growth factor receptor 1 Platelet-derived growth factor receptor beta (PDGFR-beta) Platelet-derived growth factor receptor beta (PDGFRbeta) | VHL/PDGFRB
Type:
Enzyme
Mol. Mass.:
123922.25
Organism:
Homo sapiens (Human)
Description:
P09619
Residue:
1106
  
Inhibitor
Name:
BDBM50132229
Synonyms:
4-(7-Methyl-quinazolin-4-yl)-piperazine-1-carboxylic acid (4-phenoxy-phenyl)-amide | CHEMBL323372
Type:
Small organic molecule
Emp. Form.:
C26H25N5O2
Mol. Mass.:
439.509
SMILES:
Cc1ccc2c(ncnc2c1)N1CCN(CC1)C(=O)Nc1ccc(Oc2ccccc2)cc1
: