Target
Platelet-derived growth factor receptor beta
Ligand
BDBM50132233
Substrate
Meas. Tech.
ChEBML_158518
IC50
>30000±n/a nM
Citation
 Matsuno, KSeishi, TNakajima, TIchimura, MGiese, NAYu, JCOda, SNomoto, Y Potent and selective inhibitors of platelet-derived growth factor receptor phosphorylation. Part 4: structure-activity relationships for substituents on the quinazoline moiety of 4-[4-(N-substituted(thio)carbamoyl)-1-piperazinyl]-6,7-dimethoxyquinazoline derivatives. Bioorg Med Chem Lett 13:3001-4 (2003)  
Target
Name:
Platelet-derived growth factor receptor beta
Synonyms:
Beta-type platelet-derived growth factor receptor CD140b antigen PDGF Receptor Substrate PDGFR PDGFR-1 PDGFRB PGFRB_HUMAN Platelet-derived growth factor receptor 1 Platelet-derived growth factor receptor beta (PDGFR-beta) Platelet-derived growth factor receptor beta (PDGFRbeta) | VHL/PDGFRB
Type:
Enzyme
Mol. Mass.:
123922.25
Organism:
Homo sapiens (Human)
Description:
P09619
Residue:
1106
  
Inhibitor
Name:
BDBM50132233
Synonyms:
4-(7-Chloro-6-nitro-quinazolin-4-yl)-piperazine-1-carbothioic acid benzylamide | CHEMBL100841
Type:
Small organic molecule
Emp. Form.:
C20H19ClN6O2S
Mol. Mass.:
442.922
SMILES:
[O-][N+](=O)c1cc2c(ncnc2cc1Cl)N1CCN(CC1)C(=[SH+])[N-]Cc1ccccc1
: