Target
Heat shock protein HSP 90-alpha/90-beta
Ligand
BDBM227589
Substrate
Meas. Tech.
ChEMBL_29664 (CHEMBL636772)
IC50
<200±n/a nM
Citation
 Dymock, BBarril, XBeswick, MCollier, ADavies, NDrysdale, MFink, AFromont, CHubbard, REMassey, ASurgenor, AWright, L Adenine derived inhibitors of the molecular chaperone HSP90-SAR explained through multiple X-ray structures. Bioorg Med Chem Lett 14:325-8 (2003)  
Target
Name:
Heat shock protein HSP 90-alpha/90-beta
Synonyms:
Heat Shock Protein 90 (Hsp90) Heat shock protein HSP90
Type:
Mol. Mass.:
Description:
ASSAY_ID of EBI is 29664
Components:
This complex has 2 components.
Component 1
Name:
Heat shock protein HSP 90-alpha
Synonyms:
HS90A_HUMAN HSP86 HSP90AA1 HSPCA Heat shock 86 kDa Heat shock protein HSP 90-alpha (HSP90) LAP-2 Lipopolysaccharide-associated protein 2 heat shock protein 90kDa alpha (cytosolic), class A member 1 isoform 2
Type:
Molecular Chaperone
Mol. Mass.:
84623.45
Organism:
Homo sapiens (Human)
Description:
P07900
Residue:
732
  
Component 2
Name:
Heat shock protein HSP 90-beta
Synonyms:
HS90B_HUMAN HSP 90 HSP90B HSPCB Heat shock protein HSP 90 (Hsp90)
Type:
Molecular Chaperone
Mol. Mass.:
83229.45
Organism:
Homo sapiens (Human)
Description:
P08238
Residue:
724
  
Inhibitor
Name:
BDBM227589
Synonyms:
Radicicol
Type:
Small organic molecule
Emp. Form.:
C18H17ClO6
Mol. Mass.:
364.777
SMILES:
C[C@@H]1C[C@H]2O[C@@H]2\C=C/C=C/C(=O)Cc2c(Cl)c(O)cc(O)c2C(=O)O1
: