Target
Genome polyprotein/Non-structural protein 4A
Ligand
BDBM50143468
Substrate
Meas. Tech.
ChEMBL_143636 (CHEMBL752796)
Ki
330±n/a nM
Citation
 Perni, RBFarmer, LJCottrell, KMCourt, JJCourtney, LFDeininger, DDGates, CAHarbeson, SLKim, JLLin, CLin, KLuong, YPMaxwell, JPMurcko, MAPitlik, JRao, BGSchairer, WCTung, RDVan Drie, JHWilson, KThomson, JA Inhibitors of hepatitis C virus NS3.4A protease. Part 3: P2 proline variants. Bioorg Med Chem Lett 14:1939-42 (2004)  
Target
Name:
Genome polyprotein/Non-structural protein 4A
Synonyms:
Hepatitis C virus serine protease, NS3/NS4A
Type:
Mol. Mass.:
Description:
ASSAY_ID of ChEMBL is 1969955
Components:
This complex has 2 components.
Component 1
Name:
Non-structural protein 4A
Synonyms:
Hepatitis C virus NS4A protein Non-structural protein 4A
Type:
PROTEIN
Mol. Mass.:
5762.65
Organism:
Hepatitis C virus
Description:
ChEMBL_305334
Residue:
54
  
Component 2
Name:
Genome polyprotein
Synonyms:
Hepatitis C virus NS3 protease/helicase | Hepatitis C virus serine protease, NS3/NS4A
Type:
Protein
Mol. Mass.:
67067.41
Organism:
Hepatitis C virus
Description:
A3EZI9
Residue:
631
  
Inhibitor
Name:
BDBM50143468
Synonyms:
(4S,5R)-1-((R)-2-{2-Cyclohexyl-2-[(hydroxy-pyrazin-2-yl-methyl)-amino]-acetylamino}-3,3-dimethyl-butyryl)-3-(1-ethyl-propyl)-pyrrolidine-2-carboxylic acid [1-((S)-(R)-cyclopropylaminooxalyl)-butyl]-amide | CHEMBL369413
Type:
Small organic molecule
Emp. Form.:
C38H61N7O6
Mol. Mass.:
711.9342
SMILES:
CCC[C@H](NC(=O)[C@@H]1[C@H](CCN1C(=O)[C@H](NC(=O)[C@H](NC(O)c1cnccn1)C1CCCCC1)C(C)(C)C)C(CC)CC)C(=O)C(=O)NC1CC1
: