Target
Capsid scaffolding protein
Ligand
BDBM50143635
Substrate
Meas. Tech.
ChEMBL_77299 (CHEMBL687228)
IC50
6.7±n/a nM
Citation
 Gopalsamy, ALim, KEllingboe, JWMitsner, BNikitenko, AUpeslacis, JMansour, TSOlson, MWBebernitz, GAGrinberg, DFeld, BMoy, FJO'Connell, J Design and syntheses of 1,6-naphthalene derivatives as selective HCMV protease inhibitors. J Med Chem 47:1893-9 (2004)  
Target
Name:
Capsid scaffolding protein
Synonyms:
APNG Assembly protein Human cytomegalovirus protease (HCMV Pr) Protease precursor UL80 | pPR
Type:
PROTEIN
Mol. Mass.:
73854.16
Organism:
Human cytomegalovirus (strain AD169) (HHV-5) (Human herpesvirus 5)
Description:
ChEMBL_158958
Residue:
708
  
Inhibitor
Name:
BDBM50143635
Synonyms:
CHEMBL440672 | N-[({5-[(1E)-7-chloroquinolin-2-yl)vinyl]-2-naphthyl}amino)carbonyl]benzenesulfonamide
Type:
Small organic molecule
Emp. Form.:
C28H20ClN3O3S
Mol. Mass.:
513.995
SMILES:
Clc1ccc2ccc(\C=C\c3cccc4cc(NC(=O)NS(=O)(=O)c5ccccc5)ccc34)nc2c1
: