Target
Capsid scaffolding protein
Ligand
BDBM50143650
Substrate
Meas. Tech.
ChEMBL_77299 (CHEMBL687228)
IC50
3.1±n/a nM
Citation
 Gopalsamy, ALim, KEllingboe, JWMitsner, BNikitenko, AUpeslacis, JMansour, TSOlson, MWBebernitz, GAGrinberg, DFeld, BMoy, FJO'Connell, J Design and syntheses of 1,6-naphthalene derivatives as selective HCMV protease inhibitors. J Med Chem 47:1893-9 (2004)  
Target
Name:
Capsid scaffolding protein
Synonyms:
APNG Assembly protein Human cytomegalovirus protease (HCMV Pr) Protease precursor UL80 | pPR
Type:
PROTEIN
Mol. Mass.:
73854.16
Organism:
Human cytomegalovirus (strain AD169) (HHV-5) (Human herpesvirus 5)
Description:
ChEMBL_158958
Residue:
708
  
Inhibitor
Name:
BDBM50143650
Synonyms:
4-{[5-(3-Chloro-phenoxymethyl)-naphthalen-2-ylamino]-methyl}-benzoic acid | CHEMBL56210
Type:
Small organic molecule
Emp. Form.:
C25H20ClNO3
Mol. Mass.:
417.884
SMILES:
OC(=O)c1ccc(CNc2ccc3c(COc4cccc(Cl)c4)cccc3c2)cc1
: