Target
Capsid scaffolding protein
Ligand
BDBM50143637
Substrate
Meas. Tech.
ChEMBL_77299 (CHEMBL687228)
IC50
4.3±n/a nM
Citation
 Gopalsamy, ALim, KEllingboe, JWMitsner, BNikitenko, AUpeslacis, JMansour, TSOlson, MWBebernitz, GAGrinberg, DFeld, BMoy, FJO'Connell, J Design and syntheses of 1,6-naphthalene derivatives as selective HCMV protease inhibitors. J Med Chem 47:1893-9 (2004)  
Target
Name:
Capsid scaffolding protein
Synonyms:
APNG Assembly protein Human cytomegalovirus protease (HCMV Pr) Protease precursor UL80 | pPR
Type:
PROTEIN
Mol. Mass.:
73854.16
Organism:
Human cytomegalovirus (strain AD169) (HHV-5) (Human herpesvirus 5)
Description:
ChEMBL_158958
Residue:
708
  
Inhibitor
Name:
BDBM50143637
Synonyms:
CHEMBL56633 | N-{5-[2-(4-Chloro-phenyl)-vinyl]-naphthalen-2-yl}-C,C,C-trifluoro-methanesulfonamide
Type:
Small organic molecule
Emp. Form.:
C19H13ClF3NO2S
Mol. Mass.:
411.825
SMILES:
FC(F)(F)S(=O)(=O)Nc1ccc2c(\C=C\c3ccc(Cl)cc3)cccc2c1
: