Target
Capsid scaffolding protein
Ligand
BDBM50143627
Substrate
Meas. Tech.
ChEMBL_77299 (CHEMBL687228)
IC50
3.4±n/a nM
Citation
 Gopalsamy, ALim, KEllingboe, JWMitsner, BNikitenko, AUpeslacis, JMansour, TSOlson, MWBebernitz, GAGrinberg, DFeld, BMoy, FJO'Connell, J Design and syntheses of 1,6-naphthalene derivatives as selective HCMV protease inhibitors. J Med Chem 47:1893-9 (2004)  
Target
Name:
Capsid scaffolding protein
Synonyms:
APNG Assembly protein Human cytomegalovirus protease (HCMV Pr) Protease precursor UL80 | pPR
Type:
PROTEIN
Mol. Mass.:
73854.16
Organism:
Human cytomegalovirus (strain AD169) (HHV-5) (Human herpesvirus 5)
Description:
ChEMBL_158958
Residue:
708
  
Inhibitor
Name:
BDBM50143627
Synonyms:
C,C,C-Trifluoro-N-{5-[2-(6-methoxy-quinolin-2-yl)-vinyl]-naphthalen-2-yl}-methanesulfonamide | CHEMBL433457
Type:
Small organic molecule
Emp. Form.:
C23H17F3N2O3S
Mol. Mass.:
458.453
SMILES:
COc1ccc2nc(\C=C\c3cccc4cc(NS(=O)(=O)C(F)(F)F)ccc34)ccc2c1
: