Target
Glucocorticoid receptor
Ligand
BDBM50153502
Substrate
Meas. Tech.
ChEMBL_310136 (CHEMBL838116)
EC50
5±n/a nM
Citation
 Shah, NScanlan, TS Design and evaluation of novel nonsteroidal dissociating glucocorticoid receptor ligands. Bioorg Med Chem Lett 14:5199-203 (2004)  
Target
Name:
Glucocorticoid receptor
Synonyms:
GCR_RAT Glucocorticoid Receptor (GR) Grl | Nr3c1
Type:
Enzyme Catalytic Domain
Mol. Mass.:
87556.83
Organism:
RAT
Description:
Glucocorticoid 0 RAT::P06536
Residue:
795
  
Inhibitor
Name:
BDBM50153502
Synonyms:
1-[(4aR,5S)-1-(4-Fluoro-phenyl)-4a-methyl-4,4a,5,6,7,8-hexahydro-1H-benzo[f]indazol-5-yl]-pentan-1-ol | CHEMBL186683
Type:
Small organic molecule
Emp. Form.:
C23H29FN2O
Mol. Mass.:
368.4876
SMILES:
CCCCC(O)[C@H]1CCCC2=Cc3c(C[C@]12C)cnn3-c1ccc(F)cc1
: