Target
Disintegrin and metalloproteinase domain-containing protein 10
Ligand
BDBM50156476
Substrate
Meas. Tech.
ChEMBL_305773 (CHEMBL874439)
IC50
>10500±n/a nM
Citation
 Oh, MIm, ILee, YJKim, YHYoon, JHPark, HGHigashiyama, SKim, YCPark, WJ Structure-based virtual screening and biological evaluation of potent and selective ADAM12 inhibitors. Bioorg Med Chem Lett 14:6071-4 (2004)  
Target
Name:
Disintegrin and metalloproteinase domain-containing protein 10
Synonyms:
ADA10_HUMAN Disintegrin and metalloproteinase domain-containing protein 10 (ADAM10) MADM
Type:
Enzyme
Mol. Mass.:
84160.93
Organism:
Homo sapiens (Human)
Description:
O14672
Residue:
748
  
Inhibitor
Name:
BDBM50156476
Synonyms:
2-[2-Benzoylamino-3-(2-fluoro-phenyl)-acryloylamino]-3-methyl-butyric acid | CHEMBL188414
Type:
Small organic molecule
Emp. Form.:
C21H21FN2O4
Mol. Mass.:
384.4008
SMILES:
CC(C)C(NC(=O)C(\NC(=O)c1ccccc1)=C/c1ccccc1F)C(O)=O
: