Target
Epidermal growth factor receptor
Ligand
BDBM50162147
Substrate
Meas. Tech.
ChEMBL_305356 (CHEMBL832736)
IC50
>10000±n/a nM
Citation
 Kubo, KShimizu, TOhyama, SMurooka, HIwai, ANakamura, KHasegawa, KKobayashi, YTakahashi, NTakahashi, KKato, SIzawa, TIsoe, T Novel potent orally active selective VEGFR-2 tyrosine kinase inhibitors: synthesis, structure-activity relationships, and antitumor activities of N-phenyl-N'-{4-(4-quinolyloxy)phenyl}ureas. J Med Chem 48:1359-66 (2005)  
Target
Name:
Epidermal growth factor receptor
Synonyms:
EGF Receptor Substrate EGFR_HUMAN ERBB1 Epidermal Growth Factor Receptor erbB-1 Epidermal growth factor receptor (EGFR) HER1 Proto-oncogene c-ErbB-1 Tyrosine-Protein Kinase ErbB-1
Type:
Receptor Kinase Domain
Mol. Mass.:
134279.59
Organism:
Homo sapiens (Human)
Description:
P00533
Residue:
1210
  
Inhibitor
Name:
BDBM50162147
Synonyms:
1-(2,4-Difluoro-phenyl)-3-[4-(6,7-dimethoxy-quinolin-4-yloxy)-2-fluoro-phenyl]-urea | CHEMBL178455
Type:
Small organic molecule
Emp. Form.:
C24H18F3N3O4
Mol. Mass.:
469.4126
SMILES:
COc1cc2nccc(Oc3ccc(NC(=O)Nc4ccc(F)cc4F)c(F)c3)c2cc1OC
: