Target
Platelet-derived growth factor receptor alpha
Ligand
BDBM50162140
Substrate
Meas. Tech.
ChEMBL_305182 (CHEMBL832771)
IC50
6.8±n/a nM
Citation
 Kubo, KShimizu, TOhyama, SMurooka, HIwai, ANakamura, KHasegawa, KKobayashi, YTakahashi, NTakahashi, KKato, SIzawa, TIsoe, T Novel potent orally active selective VEGFR-2 tyrosine kinase inhibitors: synthesis, structure-activity relationships, and antitumor activities of N-phenyl-N'-{4-(4-quinolyloxy)phenyl}ureas. J Med Chem 48:1359-66 (2005)  
Target
Name:
Platelet-derived growth factor receptor alpha
Synonyms:
Alpha-type platelet-derived growth factor receptor PDGFRA PGFRA_HUMAN Platelet-derived growth factor receptor alpha (PDGFRA) RHEPDGFRA
Type:
Protein
Mol. Mass.:
122633.38
Organism:
Homo sapiens (Human)
Description:
P16234
Residue:
1089
  
Inhibitor
Name:
BDBM50162140
Synonyms:
1-(3,4-Difluoro-phenyl)-3-[4-(6,7-dimethoxy-quinolin-4-yloxy)-phenyl]-urea | CHEMBL179719
Type:
Small organic molecule
Emp. Form.:
C24H19F2N3O4
Mol. Mass.:
451.4222
SMILES:
COc1cc2nccc(Oc3ccc(NC(=O)Nc4ccc(F)c(F)c4)cc3)c2cc1OC
: