Target
UDP-N-acetylglucosamine 1-carboxyvinyltransferase
Ligand
BDBM50166483
Substrate
Meas. Tech.
ChEMBL_304763 (CHEMBL829360)
IC50
33400±n/a nM
Citation
 Kutterer, KMDavis, JMSingh, GYang, YHu, WSeverin, ARasmussen, BAKrishnamurthy, GFailli, AKatz, AH 4-Alkyl and 4,4'-dialkyl 1,2-bis(4-chlorophenyl)pyrazolidine-3,5-dione derivatives as new inhibitors of bacterial cell wall biosynthesis. Bioorg Med Chem Lett 15:2527-31 (2005)  
Target
Name:
UDP-N-acetylglucosamine 1-carboxyvinyltransferase
Synonyms:
EPT MURA_ECOLI UDP-N-acetylglucosamine 1-carboxyvinyltransferase murA | murZ
Type:
Protein
Mol. Mass.:
44814.62
Organism:
Escherichia coli K-12 (Enterobacteria)
Description:
E. coli MurA
Residue:
419
  
Inhibitor
Name:
BDBM50166483
Synonyms:
4-(2-Benzyloxy-ethyl)-1,2-bis-(4-chloro-phenyl)-pyrazolidine-3,5-dione | CHEMBL195732
Type:
Small organic molecule
Emp. Form.:
C24H20Cl2N2O3
Mol. Mass.:
455.333
SMILES:
Oc1c(CCOCc2ccccc2)c(=O)n(-c2ccc(Cl)cc2)n1-c1ccc(Cl)cc1
: