Target
Epidermal growth factor receptor
Ligand
BDBM50171525
Substrate
Meas. Tech.
ChEMBL_305171 (CHEMBL832761)
IC50
0.12±n/a nM
Citation
 Mishani, EAbourbeh, GJacobson, ODissoki, SBen Daniel, RRozen, YShaul, MLevitzki, A High-affinity epidermal growth factor receptor (EGFR) irreversible inhibitors with diminished chemical reactivities as positron emission tomography (PET)-imaging agent candidates of EGFR overexpressing tumors. J Med Chem 48:5337-48 (2005)  
Target
Name:
Epidermal growth factor receptor
Synonyms:
EGF Receptor Substrate EGFR_HUMAN ERBB1 Epidermal Growth Factor Receptor erbB-1 Epidermal growth factor receptor (EGFR) HER1 Proto-oncogene c-ErbB-1 Tyrosine-Protein Kinase ErbB-1
Type:
Receptor Kinase Domain
Mol. Mass.:
134279.59
Organism:
Homo sapiens (Human)
Description:
P00533
Residue:
1210
  
Inhibitor
Name:
BDBM50171525
Synonyms:
2-Chloro-N-[4-(3-iodo-phenylamino)-quinazolin-6-yl]-acetamide | CHEMBL193160
Type:
Small organic molecule
Emp. Form.:
C16H12ClIN4O
Mol. Mass.:
438.65
SMILES:
ClCC(=O)Nc1ccc2ncnc(Nc3cccc(I)c3)c2c1
: