Target
Carbonic anhydrase 1
Ligand
BDBM50173870
Substrate
Meas. Tech.
ChEMBL_320715 (CHEMBL881701)
Ki
138±n/a nM
Citation
 Innocenti, AVillar, RMartinez-Merino, VGil, MJScozzafava, AVullo, DSupuran, CT Carbonic anhydrase inhibitors: inhibition of cytosolic/tumor-associated carbonic anhydrase isozymes I, II, and IX with benzo[b]thiophene 1,1-dioxide sulfonamides. Bioorg Med Chem Lett 15:4872-6 (2005)  
Target
Name:
Carbonic anhydrase 1
Synonyms:
CA-I CAB Carbonate dehydratase I Carbonic anhydrase 1 (CA I) Carbonic anhydrase 1 (Recombinant CA I) Carbonic anhydrase B Carbonic anhydrase I (CA I) Carbonic anhydrase I (CAI) Carbonic anhydrase isoenzyme I (hCA I) | hCA
Type:
Enzyme
Mol. Mass.:
28873.37
Organism:
Homo sapiens (Human)
Description:
P00915
Residue:
261
  
Inhibitor
Name:
BDBM50173870
Synonyms:
3-Benzyloxy-1,1-dioxo-2,3-dihydro-1H-1lambda*6*-benzo[b]thiophene-6-sulfonic acid amide | CHEMBL196202
Type:
Small organic molecule
Emp. Form.:
C15H15NO5S2
Mol. Mass.:
353.413
SMILES:
NS(=O)(=O)c1ccc2C(CS(=O)(=O)c2c1)OCc1ccccc1
: