Target
Adenosine kinase
Ligand
BDBM14486
Substrate
Meas. Tech.
ChEMBL_321616 (CHEMBL872316)
IC50
9±n/a nM
Citation
 Boyer, SHUgarkar, BGSolbach, JKopcho, JMatelich, MCOllis, KGomez-Galeno, JEMendonca, RTsuchiya, MNagahisa, ANakane, MWiesner, JBErion, MD Adenosine kinase inhibitors. 5. Synthesis, enzyme inhibition, and analgesic activity of diaryl-erythro-furanosyltubercidin analogues. J Med Chem 48:6430-41 (2005)  
Target
Name:
Adenosine kinase
Synonyms:
ADK | ADK_HUMAN
Type:
PROTEIN
Mol. Mass.:
40545.97
Organism:
Homo sapiens (Human)
Description:
ChEMBL_1467841
Residue:
362
  
Inhibitor
Name:
BDBM14486
Synonyms:
(2R,3R,4S,5R)-2-(2-amino-9-iodo-3,5,7-triazabicyclo[4.3.0]nona-1,3,5,8-tetraen-7-yl)-5-methyl-oxolane-3,4-diol 5-IT 7-(5-deoxy-beta-D-ribofuranosyl)-5-iodo-7H-pyrrolo[2,3-d]pyrimidin-4-amine | CHEMBL66280
Type:
Small organic molecule
Emp. Form.:
C11H13IN4O3
Mol. Mass.:
376.1504
SMILES:
C[C@H]1O[C@H]([C@H](O)[C@@H]1O)n1cc(I)c2c(N)ncnc12
: