Target
Adenosine kinase
Ligand
BDBM50174592
Substrate
Meas. Tech.
ChEMBL_321616 (CHEMBL872316)
IC50
6±n/a nM
Citation
 Boyer, SHUgarkar, BGSolbach, JKopcho, JMatelich, MCOllis, KGomez-Galeno, JEMendonca, RTsuchiya, MNagahisa, ANakane, MWiesner, JBErion, MD Adenosine kinase inhibitors. 5. Synthesis, enzyme inhibition, and analgesic activity of diaryl-erythro-furanosyltubercidin analogues. J Med Chem 48:6430-41 (2005)  
Target
Name:
Adenosine kinase
Synonyms:
ADK | ADK_HUMAN
Type:
PROTEIN
Mol. Mass.:
40545.97
Organism:
Homo sapiens (Human)
Description:
ChEMBL_1467841
Residue:
362
  
Inhibitor
Name:
BDBM50174592
Synonyms:
(1R,2R,3R)-2-(4-Amino-5-iodo-pyrrolo[2,3-d]pyrimidin-7-yl)-tetrahydro-furan-3,4-diol | CHEMBL194952
Type:
Small organic molecule
Emp. Form.:
C10H11IN4O3
Mol. Mass.:
362.1238
SMILES:
Nc1ncnc2n(cc(I)c12)[C@@H]1OC[C@@H](O)[C@H]1O
: