Target
Sodium- and chloride-dependent glycine transporter 1
Ligand
BDBM50175900
Substrate
Meas. Tech.
ChEMBL_329241 (CHEMBL865813)
EC50
23±n/a nM
Citation
 Pinard, ECeccarelli, SMStalder, HAlberati, D Discovery of N-(2-aryl-cyclohexyl) substituted spiropiperidines as a novel class of GlyT1 inhibitors. Bioorg Med Chem Lett 16:349-53 (2005)  
Target
Name:
Sodium- and chloride-dependent glycine transporter 1
Synonyms:
GlyT-1 Glycine Transporters (GlyT1c) SC6A9_HUMAN Sodium- and chloride-dependent glycine transporter 1 Sodium- and chloride-dependent glycine transporter 1 (GlyT1c) Solute carrier family 6 member 9
Type:
Enzyme
Mol. Mass.:
78270.54
Organism:
Homo sapiens (Human)
Description:
P48067
Residue:
706
  
Inhibitor
Name:
BDBM50175900
Synonyms:
8-[(1S,2S)-2-(4-fluoro-phenyl)-cyclohexyl]-1-phenyl-1,3,8-triaza-spiro[4.5]decan-4-one | CHEMBL199888
Type:
Small organic molecule
Emp. Form.:
C25H30FN3O
Mol. Mass.:
407.5236
SMILES:
Fc1ccc(cc1)[C@@H]1CCCC[C@@H]1N1CCC2(CC1)N(CNC2=O)c1ccccc1
: