Target
Mu-type opioid receptor
Ligand
BDBM50175903
Substrate
Meas. Tech.
ChEMBL_329245 (CHEMBL864595)
IC50
150±n/a nM
Citation
 Pinard, ECeccarelli, SMStalder, HAlberati, D Discovery of N-(2-aryl-cyclohexyl) substituted spiropiperidines as a novel class of GlyT1 inhibitors. Bioorg Med Chem Lett 16:349-53 (2005)  
Target
Name:
Mu-type opioid receptor
Synonyms:
M-OR-1 MOR-1 MUOR1 Mu opiate receptor OPRM1 hMOP | mu-type opioid receptor isoform MOR-1
Type:
G Protein-Coupled Receptor (GPCR)
Mol. Mass.:
44789.51
Organism:
Homo sapiens (Human)
Description:
P35372
Residue:
400
  
Inhibitor
Name:
BDBM50175903
Synonyms:
1-Phenyl-8-((cis,1S,2S)-2-phenyl-cyclohexyl)-1,3,8-triaza-spiro[4.5]decan-4-one 1-phenyl-8-((cis,rac)-2-phenyl-cyclohexyl)-1,3,8-triaza-spiro[4.5]decan-4-one cis-1-phenyl-8-(2-phenyl-cyclohexyl)-1,3,8-triaza-spiro[4.5]decan-4-one
Type:
Small organic molecule
Emp. Form.:
C25H31N3O
Mol. Mass.:
389.5331
SMILES:
O=C1NCN(c2ccccc2)C11CCN(CC1)[C@H]1CCCC[C@H]1c1ccccc1
: