Target
D(2) dopamine receptor
Ligand
BDBM50176025
Substrate
Meas. Tech.
ChEMBL_320895 (CHEMBL872394)
Ki
24±n/a nM
Citation
 Smid, PCoolen, HKKeizer, HGvan Hes, Rde Moes, JPden Hartog, APStork, BPlekkenpol, RHNiemann, LCStroomer, CNTulp, MTvan Stuivenberg, HHMcCreary, ACHesselink, MBHerremans, AHKruse, CG Synthesis, structure-activity relationships, and biological properties of 1-heteroaryl-4-[omega-(1H-indol-3-yl)alkyl]piperazines, novel potential antipsychotics combining potent dopamine D2 receptor antagonism with potent serotonin reuptake inhibition. J Med Chem 48:6855-69 (2005)  
Target
Name:
D(2) dopamine receptor
Synonyms:
D(2) dopamine receptor DOPAMINE D2 Long DRD2 Dopamine D2 receptor Dopamine D2 receptor (D2R) Dopamine2-like | d2
Type:
Cell-surface receptors
Mol. Mass.:
50647.10
Organism:
Homo sapiens (Human)
Description:
P14416
Residue:
443
  
Inhibitor
Name:
BDBM50176025
Synonyms:
4-Chloro-3-{3-[4-(2,3-dihydro-benzo[1,4]dioxin-5-yl)-piperazin-1-yl]-propyl}-1H-indole | CHEMBL365605
Type:
Small organic molecule
Emp. Form.:
C23H26ClN3O2
Mol. Mass.:
411.924
SMILES:
Clc1cccc2[nH]cc(CCCN3CCN(CC3)c3cccc4OCCOc34)c12
: