Target
Caspase-1
Ligand
BDBM50176514
Substrate
Meas. Tech.
ChEMBL_332180 (CHEMBL869995)
Ki
2100±n/a nM
Citation
 Fahr, BTO'Brien, TPham, PWaal, NDBaskaran, SRaimundo, BCLam, JWSopko, MMPurkey, HERomanowski, MJ Tethering identifies fragment that yields potent inhibitors of human caspase-1. Bioorg Med Chem Lett 16:559-62 (2005)  
Target
Name:
Caspase-1
Synonyms:
CASP1 Caspase ICE IL1BCE Interleukin-1 beta-converting enzyme
Type:
Enzyme
Mol. Mass.:
45154.13
Organism:
Homo sapiens (Human)
Description:
P29466
Residue:
404
  
Inhibitor
Name:
BDBM50176514
Synonyms:
(S)-4-oxo-3-(2-((4-(quinoxalin-2-ylamino)benzamido)methyl)furan-5-carboxamido)butanoic acid | CHEMBL380787
Type:
Small organic molecule
Emp. Form.:
C25H21N5O6
Mol. Mass.:
487.4641
SMILES:
OC(=O)C[C@H](NC(=O)c1ccc(CNC(=O)c2ccc(Nc3cnc4ccccc4n3)cc2)o1)C=O
: