Target
Caspase-1
Ligand
BDBM50176516
Substrate
Meas. Tech.
ChEMBL_332180 (CHEMBL869995)
Ki
2100±n/a nM
Citation
 Fahr, BTO'Brien, TPham, PWaal, NDBaskaran, SRaimundo, BCLam, JWSopko, MMPurkey, HERomanowski, MJ Tethering identifies fragment that yields potent inhibitors of human caspase-1. Bioorg Med Chem Lett 16:559-62 (2005)  
Target
Name:
Caspase-1
Synonyms:
CASP1 Caspase ICE IL1BCE Interleukin-1 beta-converting enzyme
Type:
Enzyme
Mol. Mass.:
45154.13
Organism:
Homo sapiens (Human)
Description:
P29466
Residue:
404
  
Inhibitor
Name:
BDBM50176516
Synonyms:
(S)-4-oxo-3-(7-oxo-7-(4-(quinoxalin-2-ylamino)phenylamino)heptanamido)butanoic acid | CHEMBL201919
Type:
Small organic molecule
Emp. Form.:
C25H27N5O5
Mol. Mass.:
477.5124
SMILES:
OC(=O)C[C@H](NC(=O)CCCCCC(=O)Nc1ccc(Nc2cnc3ccccc3n2)cc1)C=O
: