Target
Tyrosine-protein phosphatase non-receptor type 1
Ligand
BDBM50179013
Substrate
Meas. Tech.
ChEMBL_339770 (CHEMBL862180)
IC50
>80000±n/a nM
Citation
 Cui, LNa, MOh, HBae, EYJeong, DGRyu, SEKim, SKim, BYOh, WKAhn, JS Protein tyrosine phosphatase 1B inhibitors from Morus root bark. Bioorg Med Chem Lett 16:1426-9 (2006)  
Target
Name:
Tyrosine-protein phosphatase non-receptor type 1
Synonyms:
PTN1_HUMAN PTPN1 Protein tyrosine phosphatase-1B (PTP1B) Protein-tyrosine phosphatase 1B (PTP1B) Tyrosine-protein phosphatase non-receptor type 1 (PTP1B)
Type:
Protein phosphatase
Mol. Mass.:
49963.76
Organism:
Homo sapiens (Human)
Description:
Human recombinant GST-fusion PTP1B (1-435).
Residue:
435
  
Inhibitor
Name:
BDBM50179013
Synonyms:
CHEMBL205924 | moracin O
Type:
Small organic molecule
Emp. Form.:
C19H18O5
Mol. Mass.:
326.3432
SMILES:
CC(C)(O)C1Cc2cc3cc(oc3cc2O1)-c1cc(O)cc(O)c1
: