Target
Vascular endothelial growth factor receptor 2
Ligand
BDBM50179145
Substrate
Meas. Tech.
ChEMBL_339231 (CHEMBL866567)
IC50
210±n/a nM
Citation
 Kiselyov, ASSemenova, MSemenov, VVPiatnitski, E 2-((1H-Azol-1-yl)methyl)-N-arylbenzamides: novel dual inhibitors of VEGFR-1/2 kinases. Bioorg Med Chem Lett 16:1726-30 (2006)  
Target
Name:
Vascular endothelial growth factor receptor 2
Synonyms:
CD_antigen=CD309 Fetal liver kinase 1 (FLK-1) KDR Protein-tyrosine kinase receptor Flk-1 VEGFR-2 VEGFR2 Vascular Endothelial Growth Factor Receptor Kinase 2 Vascular endothelial growth factor receptor 2 (KDR) Vascular endothelial growth factor receptor 2 (VEGFR2) Vascular endothelial growth factor receptor-2 (VEGFR-2)
Type:
Receptor Tyrosine Kinase
Mol. Mass.:
151510.97
Organism:
Homo sapiens (Human)
Description:
P35968
Residue:
1356
  
Inhibitor
Name:
BDBM50179145
Synonyms:
2-((5H-imidazo[4,5-c]pyridin-5-yl)methyl)-N-(2-fluoro-4-methylphenyl)benzamide | CHEMBL206403
Type:
Small organic molecule
Emp. Form.:
C21H17FN4O
Mol. Mass.:
360.3843
SMILES:
Cc1ccc(NC(=O)c2ccccc2Cn2ccc3ncnc3c2)c(F)c1
: