Target
Vascular endothelial growth factor receptor 2
Ligand
BDBM50179170
Substrate
Meas. Tech.
ChEMBL_339231 (CHEMBL866567)
IC50
>10000±n/a nM
Citation
 Kiselyov, ASSemenova, MSemenov, VVPiatnitski, E 2-((1H-Azol-1-yl)methyl)-N-arylbenzamides: novel dual inhibitors of VEGFR-1/2 kinases. Bioorg Med Chem Lett 16:1726-30 (2006)  
Target
Name:
Vascular endothelial growth factor receptor 2
Synonyms:
CD_antigen=CD309 Fetal liver kinase 1 (FLK-1) KDR Protein-tyrosine kinase receptor Flk-1 VEGFR-2 VEGFR2 Vascular Endothelial Growth Factor Receptor Kinase 2 Vascular endothelial growth factor receptor 2 (KDR) Vascular endothelial growth factor receptor 2 (VEGFR2) Vascular endothelial growth factor receptor-2 (VEGFR-2)
Type:
Receptor Tyrosine Kinase
Mol. Mass.:
151510.97
Organism:
Homo sapiens (Human)
Description:
P35968
Residue:
1356
  
Inhibitor
Name:
BDBM50179170
Synonyms:
CHEMBL379888 | N-(4-chlorophenyl)-2-((5-methoxy-1H-indol-1-yl)methyl)benzamide
Type:
Small organic molecule
Emp. Form.:
C23H19ClN2O2
Mol. Mass.:
390.862
SMILES:
COc1ccc2n(Cc3ccccc3C(=O)Nc3ccc(Cl)cc3)ccc2c1
: