Target
Serine/threonine-protein kinase B-raf
Ligand
BDBM50180335
Substrate
Meas. Tech.
ChEMBL_329643 (CHEMBL865836)
IC50
39000±n/a nM
Citation
 Niculescu-Duvaz, IRoman, EWhittaker, SRFriedlos, FKirk, RScanlon, IJDavies, LCNiculescu-Duvaz, DMarais, RSpringer, CJ Novel inhibitors of B-RAF based on a disubstituted pyrazine scaffold. Generation of a nanomolar lead. J Med Chem 49:407-16 (2006)  
Target
Name:
Serine/threonine-protein kinase B-raf
Synonyms:
B-RAF B-Raf proto-oncogene serine/threonine-protein kinase BRAF1 RAFB1 v-Raf murine sarcoma viral oncogene homolog B1
Type:
Serine/threonine-protein kinase
Mol. Mass.:
84446.00
Organism:
Homo sapiens (Human)
Description:
P15056
Residue:
766
  
Inhibitor
Name:
BDBM50180335
Synonyms:
2-(2,2,3,3-Tetrafluoro-2,3-dihydrobenzo[b][1,4]dioxin-6-ylamino)-6-(3-acetamidophenyl)pyrazine | CHEMBL373242
Type:
Small organic molecule
Emp. Form.:
C20H14F4N4O3
Mol. Mass.:
434.3438
SMILES:
CC(=O)Nc1cccc(c1)-c1cncc(Nc2ccc3OC(F)(F)C(F)(F)Oc3c2)n1
: