Target
Serine/threonine-protein kinase B-raf
Ligand
BDBM50180354
Substrate
Meas. Tech.
ChEMBL_329644 (CHEMBL865837)
IC50
2300±n/a nM
Citation
 Niculescu-Duvaz, IRoman, EWhittaker, SRFriedlos, FKirk, RScanlon, IJDavies, LCNiculescu-Duvaz, DMarais, RSpringer, CJ Novel inhibitors of B-RAF based on a disubstituted pyrazine scaffold. Generation of a nanomolar lead. J Med Chem 49:407-16 (2006)  
Target
Name:
Serine/threonine-protein kinase B-raf
Synonyms:
B-RAF B-Raf proto-oncogene serine/threonine-protein kinase BRAF1 RAFB1 v-Raf murine sarcoma viral oncogene homolog B1
Type:
Serine/threonine-protein kinase
Mol. Mass.:
84446.00
Organism:
Homo sapiens (Human)
Description:
P15056
Residue:
766
  
Inhibitor
Name:
BDBM50180354
Synonyms:
2-(4-Morpholinophenylamino)-6-(3-acetamidophenyl)pyrazine | CHEMBL383374
Type:
Small organic molecule
Emp. Form.:
C22H23N5O2
Mol. Mass.:
389.4503
SMILES:
CC(=O)Nc1cccc(c1)-c1cncc(Nc2ccc(cc2)N2CCOCC2)n1
: