Target
Serine/threonine-protein kinase B-raf
Ligand
BDBM50180362
Substrate
Meas. Tech.
ChEMBL_329643 (CHEMBL865836)
IC50
26000±n/a nM
Citation
 Niculescu-Duvaz, IRoman, EWhittaker, SRFriedlos, FKirk, RScanlon, IJDavies, LCNiculescu-Duvaz, DMarais, RSpringer, CJ Novel inhibitors of B-RAF based on a disubstituted pyrazine scaffold. Generation of a nanomolar lead. J Med Chem 49:407-16 (2006)  
Target
Name:
Serine/threonine-protein kinase B-raf
Synonyms:
B-RAF B-Raf proto-oncogene serine/threonine-protein kinase BRAF1 RAFB1 v-Raf murine sarcoma viral oncogene homolog B1
Type:
Serine/threonine-protein kinase
Mol. Mass.:
84446.00
Organism:
Homo sapiens (Human)
Description:
P15056
Residue:
766
  
Inhibitor
Name:
BDBM50180362
Synonyms:
CHEMBL199798 | N-(3-(6-(4-methoxyphenylamino)pyrazin-2-yl)phenyl)acetamide
Type:
Small organic molecule
Emp. Form.:
C19H18N4O2
Mol. Mass.:
334.3718
SMILES:
COc1ccc(Nc2cncc(n2)-c2cccc(NC(C)=O)c2)cc1
: