Target
cGMP-dependent protein kinase
Ligand
BDBM50182355
Substrate
Meas. Tech.
ChEMBL_349021 (CHEMBL865064)
IC50
0.13±n/a nM
Citation
 Biftu, TFeng, DFisher, MLiang, GBQian, XScribner, ADennis, RLee, SLiberator, PABrown, CGurnett, ALeavitt, PSThompson, DMathew, JMisura, ASamaras, STamas, TSina, JFMcNulty, KAMcKnight, CGSchmatz, DMWyvratt, M Synthesis and SAR studies of very potent imidazopyridine antiprotozoal agents. Bioorg Med Chem Lett 16:2479-83 (2006)  
Target
Name:
cGMP-dependent protein kinase
Synonyms:
Type:
PROTEIN
Mol. Mass.:
112911.27
Organism:
Eimeria tenella
Description:
ChEMBL_469577
Residue:
1003
  
Inhibitor
Name:
BDBM50182355
Synonyms:
4-(7-((dimethylamino)methyl)-2-(4-fluorophenyl)H-imidazo[1,2-a]pyridin-3-yl)-N-propylpyrimidin-2-amine {4-[7-dimethylaminomethyl-2-(4-fluorophenyl)imidazo[1,2-a]pyridin-3-yl]pyrimidin-2-yl}propylamine
Type:
Small organic molecule
Emp. Form.:
C23H25FN6
Mol. Mass.:
404.4832
SMILES:
CCCNc1nccc(n1)-c1c(nc2cc(CN(C)C)ccn12)-c1ccc(F)cc1
: