Target
cGMP-dependent protein kinase
Ligand
BDBM50183916
Substrate
Meas. Tech.
ChEMBL_350591 (CHEMBL868999)
IC50
2.5±n/a nM
Citation
 Qian, XLiang, GBFeng, DFisher, MCrumley, TRattray, SDulski, PMGurnett, ALeavitt, PSLiberator, PAMisura, ASSamaras, STamas, TSchmatz, DMWyvratt, MBiftu, T Synthesis and SAR studies of diarylpyrrole anticoccidial agents. Bioorg Med Chem Lett 16:2817-21 (2006)  
Target
Name:
cGMP-dependent protein kinase
Synonyms:
Type:
PROTEIN
Mol. Mass.:
112911.27
Organism:
Eimeria tenella
Description:
ChEMBL_469577
Residue:
1003
  
Inhibitor
Name:
BDBM50183916
Synonyms:
2-(5-(4-fluorophenyl)-4-(pyridin-4-yl)-1H-pyrrol-2-yl)-N,N-dimethylethanamine | CHEMBL381773
Type:
Small organic molecule
Emp. Form.:
C19H20FN3
Mol. Mass.:
309.3806
SMILES:
CN(C)CCc1cc(c([nH]1)-c1ccc(F)cc1)-c1ccncc1
: