Target
Focal adhesion kinase 1
Ligand
BDBM50184035
Substrate
Meas. Tech.
ChEMBL_355040 (CHEMBL870124)
IC50
63±n/a nM
Citation
 Choi, HSWang, ZRichmond, WHe, XYang, KJiang, TKaranewsky, DGu, XJZhou, VLiu, YChe, JLee, CCCaldwell, JKanazawa, TUmemura, IMatsuura, NOhmori, OHonda, TGray, NHe, Y Design and synthesis of 7H-pyrrolo[2,3-d]pyrimidines as focal adhesion kinase inhibitors. Part 2. Bioorg Med Chem Lett 16:2689-92 (2006)  
Target
Name:
Focal adhesion kinase 1
Synonyms:
FADK 1 FAK1 FLT4 Focal adhesion kinase (FAK) Focal adhesion kinase 1 (FAK) Focal adhesion kinase-related nonkinase PTK2 Protein-tyrosine kinase 2 p125FAK | pp125FAK
Type:
Tyrosine-protein kinase
Mol. Mass.:
119233.17
Organism:
Homo sapiens (Human)
Description:
Q05397
Residue:
1052
  
Inhibitor
Name:
BDBM50184035
Synonyms:
CHEMBL207499 | N-isobutyl-3-(3-(2-(3,4,5-trimethoxyphenylamino)-7H-pyrrolo[2,3-d]pyrimidin-7-yl)phenyl)propanamide
Type:
Small organic molecule
Emp. Form.:
C28H33N5O4
Mol. Mass.:
503.5927
SMILES:
COc1cc(Nc2ncc3ccn(-c4cccc(CCC(=O)NCC(C)C)c4)c3n2)cc(OC)c1OC
: