Target
Dimer of Tryptase beta-2
Ligand
BDBM50184501
Substrate
Meas. Tech.
ChEMBL_365130 (CHEMBL867493)
IC50
1300±n/a nM
Citation
 Miyazaki, YKato, YManabe, TShimada, HMizuno, MEgusa, TOhkouchi, MShiromizu, IMatsusue, TYamamoto, I Synthesis and evaluation of 4-substituted benzylamine derivatives as beta-tryptase inhibitors. Bioorg Med Chem Lett 16:2986-90 (2006)  
Target
Name:
Dimer of Tryptase beta-2
Synonyms:
Tryptase beta-1/beta-2
Type:
Mol. Mass.:
Description:
ASSAY_ID of EBI is 365130
Components:
This complex has 2 components.
Component 1
Name:
Tryptase beta-2
Synonyms:
TPS2 TRYB2_HUMAN Tryptase II Tryptase-2
Type:
PROTEIN
Mol. Mass.:
30518.79
Organism:
Homo sapiens (Human)
Description:
ChEMBL_210702
Residue:
275
  
Component 2
Name:
Tryptase beta-2
Synonyms:
TPS2 TRYB2_HUMAN Tryptase II Tryptase-2
Type:
PROTEIN
Mol. Mass.:
30518.79
Organism:
Homo sapiens (Human)
Description:
ChEMBL_210702
Residue:
275
  
Inhibitor
Name:
BDBM50184501
Synonyms:
CHEMBL379752 | N-(3-(4-(aminomethyl)phenyl)propyl)-2-(naphthalene-2-sulfonamido)acetamide
Type:
Small organic molecule
Emp. Form.:
C22H25N3O3S
Mol. Mass.:
411.517
SMILES:
NCc1ccc(CCCNC(=O)CNS(=O)(=O)c2ccc3ccccc3c2)cc1
: