Target
Inosine-5'-monophosphate dehydrogenase 1
Ligand
BDBM19264
Substrate
Meas. Tech.
ChEMBL_371820 (CHEMBL865551)
IC50
32±n/a nM
Citation
 Watkins, WJChen, JMCho, AChong, LCollins, NFardis, MHuang, WHung, MKirschberg, TLee, WALiu, XThomas, WXu, JZeynalzadegan, AZhang, J Phosphonic acid-containing analogues of mycophenolic acid as inhibitors of IMPDH. Bioorg Med Chem Lett 16:3479-83 (2006)  
Target
Name:
Inosine-5'-monophosphate dehydrogenase 1
Synonyms:
IMDH1_HUMAN IMPD 1 IMPDH-I Inosine Monophosphate Dehydrogenase Type 1 (IMPDH1) | Inosine-5'-monophosphate dehydrogenase (IMPDH)
Type:
Enzyme
Mol. Mass.:
55407.70
Organism:
Homo sapiens (Human)
Description:
Recombinant IMPDH1 expressed in E. coli.
Residue:
514
  
Inhibitor
Name:
BDBM19264
Synonyms:
(4E)-6-(4-hydroxy-6-methoxy-7-methyl-3-oxo-1,3-dihydro-2-benzofuran-5-yl)-4-methylhex-4-enoic acid CHEMBL866 Mycophenolic Acid (MPA) | Myfortic
Type:
Small organic molecule
Emp. Form.:
C17H20O6
Mol. Mass.:
320.3371
SMILES:
COc1c(C)c2COC(=O)c2c(O)c1C\C=C(/C)CCC(O)=O
: