Target
Protein kinase C theta type
Ligand
BDBM50185931
Substrate
Meas. Tech.
ChEMBL_352186 (CHEMBL869666)
Ki
290±n/a nM
Citation
 Nakagawa, YIrie, KYanagita, RCOhigashi, HTsuda, KKashiwagi, KSaito, N Design and synthesis of 8-octyl-benzolactam-V9, a selective activator for protein kinase C epsilon and eta. J Med Chem 49:2681-8 (2006)  
Target
Name:
Protein kinase C theta type
Synonyms:
KPCT_HUMAN PRKCT Protein kinase C theta type (PRKCQ) nPKC-theta
Type:
Serine/threonine-protein kinase
Mol. Mass.:
81878.04
Organism:
Homo sapiens (Human)
Description:
Full-length human PKC theta (Panvera Catalog No. P2996).
Residue:
706
  
Inhibitor
Name:
BDBM50185931
Synonyms:
8-Octyl-benzolactam-V9 | CHEMBL206866
Type:
Small organic molecule
Emp. Form.:
C24H40N2O2
Mol. Mass.:
388.5866
SMILES:
CCCCCCCCc1cccc2N(C)[C@@H](C(C)C)C(=O)N[C@H](CO)CCc12
: