Target
Sphingosine 1-phosphate receptor 1
Ligand
BDBM22223
Substrate
Meas. Tech.
ChEMBL_376406 (CHEMBL866632)
EC50
<0.08±n/a nM
Citation
 Yan, LHuo, PDoherty, GToth, LHale, JJMills, SGHajdu, RKeohane, CARosenbach, MJMilligan, JAShei, GJChrebet, GBergstrom, JCard, DQuackenbush, EWickham, AMandala, SM Discovery of 3-arylpropionic acids as potent agonists of sphingosine-1-phosphate receptor-1 (S1P1) with high selectivity against all other known S1P receptor subtypes. Bioorg Med Chem Lett 16:3679-83 (2006)  
Target
Name:
Sphingosine 1-phosphate receptor 1
Synonyms:
CHEDG1 Endothelial differentiation G-protein coupled receptor 1 S1P1 S1PR1_HUMAN Sphingosine 1-phosphate receptor Edg-1
Type:
Enzyme
Mol. Mass.:
42836.02
Organism:
Homo sapiens (Human)
Description:
P21453
Residue:
382
  
Inhibitor
Name:
BDBM22223
Synonyms:
3-(4-{5-[3-cyano-4-(propan-2-yloxy)phenyl]-1,2,4-oxadiazol-3-yl}-3-methylphenyl)propanoic acid CHEMBL211505
Type:
Small organic molecule
Emp. Form.:
C22H21N3O4
Mol. Mass.:
391.4198
SMILES:
CC(C)Oc1ccc(cc1C#N)-c1nc(no1)-c1ccc(CCC(O)=O)cc1C
: