Target
Sphingosine 1-phosphate receptor 3
Ligand
BDBM50186920
Substrate
Meas. Tech.
ChEMBL_376408 (CHEMBL866636)
EC50
230±n/a nM
Citation
 Yan, LHuo, PDoherty, GToth, LHale, JJMills, SGHajdu, RKeohane, CARosenbach, MJMilligan, JAShei, GJChrebet, GBergstrom, JCard, DQuackenbush, EWickham, AMandala, SM Discovery of 3-arylpropionic acids as potent agonists of sphingosine-1-phosphate receptor-1 (S1P1) with high selectivity against all other known S1P receptor subtypes. Bioorg Med Chem Lett 16:3679-83 (2006)  
Target
Name:
Sphingosine 1-phosphate receptor 3
Synonyms:
C9orf108 EDG3 S1P receptor 3 S1P3 S1PR3_HUMAN Sphingosine 1-phosphate receptor 3 (S1P3) | Sphingosine 1-phosphate receptor Edg-3
Type:
G Protein-Coupled Receptor (GPCR)
Mol. Mass.:
42278.13
Organism:
Homo sapiens (Human)
Description:
Q99500
Residue:
378
  
Inhibitor
Name:
BDBM50186920
Synonyms:
3-(4-(5-(3-bromo-4-isopropoxyphenyl)-1,2,4-oxadiazol-3-yl)-3-methylphenyl)propanoic acid | CHEMBL210316
Type:
Small organic molecule
Emp. Form.:
C21H21BrN2O4
Mol. Mass.:
445.306
SMILES:
CC(C)Oc1ccc(cc1Br)-c1nc(no1)-c1ccc(CCC(O)=O)cc1C
: