Target
Sphingosine 1-phosphate receptor 4
Ligand
BDBM50186916
Substrate
Meas. Tech.
ChEMBL_376409 (CHEMBL866637)
EC50
>10000±n/a nM
Citation
 Yan, LHuo, PDoherty, GToth, LHale, JJMills, SGHajdu, RKeohane, CARosenbach, MJMilligan, JAShei, GJChrebet, GBergstrom, JCard, DQuackenbush, EWickham, AMandala, SM Discovery of 3-arylpropionic acids as potent agonists of sphingosine-1-phosphate receptor-1 (S1P1) with high selectivity against all other known S1P receptor subtypes. Bioorg Med Chem Lett 16:3679-83 (2006)  
Target
Name:
Sphingosine 1-phosphate receptor 4
Synonyms:
EDG6 S1P receptor 4 S1P4 S1PR4_HUMAN Sphingosine 1-phosphate receptor Edg-6 sphingosine-1-phosphate 4 S1P4
Type:
G Protein-Coupled Receptor (GPCR)
Mol. Mass.:
41647.39
Organism:
Homo sapiens (Human)
Description:
Residue:
384
  
Inhibitor
Name:
BDBM50186916
Synonyms:
3-(4-(5-(5-butylpyridin-2-yl)-1,2,4-oxadiazol-3-yl)-3-methylphenyl)propanoic acid | CHEMBL210224
Type:
Small organic molecule
Emp. Form.:
C21H23N3O3
Mol. Mass.:
365.4256
SMILES:
CCCCc1ccc(nc1)-c1nc(no1)-c1ccc(CCC(O)=O)cc1C
: