Target
Sphingosine 1-phosphate receptor 2
Ligand
BDBM50186404
Substrate
Meas. Tech.
ChEMBL_376407 (CHEMBL866633)
EC50
>10000±n/a nM
Citation
 Yan, LHuo, PDoherty, GToth, LHale, JJMills, SGHajdu, RKeohane, CARosenbach, MJMilligan, JAShei, GJChrebet, GBergstrom, JCard, DQuackenbush, EWickham, AMandala, SM Discovery of 3-arylpropionic acids as potent agonists of sphingosine-1-phosphate receptor-1 (S1P1) with high selectivity against all other known S1P receptor subtypes. Bioorg Med Chem Lett 16:3679-83 (2006)  
Target
Name:
Sphingosine 1-phosphate receptor 2
Synonyms:
EDG5 S1PR2 Sphingosine 1-phosphate receptor Sphingosine-1-phosphate receptor 2 | ndothelial differentiation G-protein coupled receptor 5
Type:
G Protein-Coupled Receptor (GPCR)
Mol. Mass.:
38883.16
Organism:
Homo sapiens (Human)
Description:
Membranes isolated from S1P2-transfected CHO cells were used in ligand binding assay.
Residue:
353
  
Inhibitor
Name:
BDBM50186404
Synonyms:
3-(4-(5-(5-chloro-6-isopropoxypyridin-3-yl)-1,2,4-oxadiazol-3-yl)-3-methylphenyl)propanoic acid | CHEMBL210695
Type:
Small organic molecule
Emp. Form.:
C20H20ClN3O4
Mol. Mass.:
401.843
SMILES:
CC(C)Oc1ncc(cc1Cl)-c1nc(no1)-c1ccc(CCC(O)=O)cc1C
: