Target
Sphingosine 1-phosphate receptor 5
Ligand
BDBM50186928
Substrate
Meas. Tech.
ChEMBL_376410 (CHEMBL866638)
EC50
1080±n/a nM
Citation
 Yan, LHuo, PDoherty, GToth, LHale, JJMills, SGHajdu, RKeohane, CARosenbach, MJMilligan, JAShei, GJChrebet, GBergstrom, JCard, DQuackenbush, EWickham, AMandala, SM Discovery of 3-arylpropionic acids as potent agonists of sphingosine-1-phosphate receptor-1 (S1P1) with high selectivity against all other known S1P receptor subtypes. Bioorg Med Chem Lett 16:3679-83 (2006)  
Target
Name:
Sphingosine 1-phosphate receptor 5
Synonyms:
EDG8 S1P5 S1PR5_HUMAN Sphingosine 1-phosphate receptor Edg-8
Type:
G Protein-Coupled Receptor (GPCR)
Mol. Mass.:
41796.42
Organism:
Homo sapiens (Human)
Description:
Residue:
398
  
Inhibitor
Name:
BDBM50186928
Synonyms:
6-(4-(5-(4-cyclohexylphenyl)-1,2,4-oxadiazol-3-yl)-3-methylphenyl)hexanoic acid | CHEMBL209008
Type:
Small organic molecule
Emp. Form.:
C27H32N2O3
Mol. Mass.:
432.5546
SMILES:
Cc1cc(CCCCCC(O)=O)ccc1-c1noc(n1)-c1ccc(cc1)C1CCCCC1
: