Target
Dimer of Tryptase beta-2
Ligand
BDBM50187155
Substrate
Meas. Tech.
ChEMBL_387229 (CHEMBL864198)
Ki
60±n/a nM
Citation
 Lee, CSLiu, WSprengeler, PASomoza, JRJanc, JWSperandio, DSpencer, JRGreen, MJMcGrath, ME Design of novel, potent, and selective human beta-tryptase inhibitors based on alpha-keto-[1,2,4]-oxadiazoles. Bioorg Med Chem Lett 16:4036-40 (2006)  
Target
Name:
Dimer of Tryptase beta-2
Synonyms:
Tryptase beta-1/beta-2
Type:
Mol. Mass.:
Description:
ASSAY_ID of EBI is 365130
Components:
This complex has 2 components.
Component 1
Name:
Tryptase beta-2
Synonyms:
TPS2 TRYB2_HUMAN Tryptase II Tryptase-2
Type:
PROTEIN
Mol. Mass.:
30518.79
Organism:
Homo sapiens (Human)
Description:
ChEMBL_210702
Residue:
275
  
Component 2
Name:
Tryptase beta-2
Synonyms:
TPS2 TRYB2_HUMAN Tryptase II Tryptase-2
Type:
PROTEIN
Mol. Mass.:
30518.79
Organism:
Homo sapiens (Human)
Description:
ChEMBL_210702
Residue:
275
  
Inhibitor
Name:
BDBM50187155
Synonyms:
(S)-benzyl 1-(5-(4-((4-phenylbutyl)carbamoyl)benzyl)-1,2,4-oxadiazol-3-yl)-6-amino-1-oxohexan-2-ylcarbamate | CHEMBL214148
Type:
Small organic molecule
Emp. Form.:
C34H39N5O5
Mol. Mass.:
597.704
SMILES:
NCCCC[C@H](NC(=O)OCc1ccccc1)C(=O)c1noc(Cc2ccc(cc2)C(=O)NCCCCc2ccccc2)n1
: