Target
Prolyl endopeptidase FAP
Ligand
BDBM50187258
Substrate
Meas. Tech.
ChEMBL_357377 (CHEMBL854262)
IC50
>30000±n/a nM
Citation
 Wright, SWAmmirati, MJAndrews, KMBrodeur, AMDanley, DEDoran, SDLillquist, JSMcClure, LDMcPherson, RKOrena, SJParker, JCPolivkova, JQiu, XSoeller, WCSoglia, CBTreadway, JLVanVolkenburg, MAWang, HWilder, DCOlson, TV cis-2,5-dicyanopyrrolidine inhibitors of dipeptidyl peptidase IV: synthesis and in vitro, in vivo, and X-ray crystallographic characterization. J Med Chem 49:3068-76 (2006)  
Target
Name:
Prolyl endopeptidase FAP
Synonyms:
170 kDa melanoma membrane-bound gelatinase Fibroblast Activation Protein (FAP) Integral membrane serine protease Seprase
Type:
Enzyme
Mol. Mass.:
87712.48
Organism:
Homo sapiens (Human)
Description:
Q12884
Residue:
760
  
Inhibitor
Name:
BDBM50187258
Synonyms:
(2S,5R)-1-[2-(hexahydro-2,5-methano-pentalen-3a-ylamino)-acetyl]-pyrrolidine-2,5-dicarbonitrile | CHEMBL383488
Type:
Small organic molecule
Emp. Form.:
C17H22N4O
Mol. Mass.:
298.3828
SMILES:
O=C(CNC12CC3CC1CC(C2)C3)N1[C@@H](CC[C@@H]1C#N)C#N
: