Target
Calpain-2 catalytic subunit
Ligand
BDBM50189824
Substrate
Meas. Tech.
ChEMBL_367108 (CHEMBL863672)
IC50
>100000±n/a nM
Citation
 Shirasaki, YNakamura, MYamaguchi, MMiyashita, HSakai, OInoue, J Exploration of orally available calpain inhibitors 2: peptidyl hemiacetal derivatives. J Med Chem 49:3926-32 (2006)  
Target
Name:
Calpain-2 catalytic subunit
Synonyms:
3.4.22.53 CANP 2 Calcium-activated neutral proteinase 2 Calpain M-type Calpain-2 large subunit Millimolar-calpain
Type:
Mol. Mass.:
37789.71
Organism:
Sus scrofa
Description:
Residue:
324
  
Inhibitor
Name:
BDBM50189824
Synonyms:
CHEMBL206737 | N-(1-cyano-3-methylbutyl)-2-((4-fluorophenyl)sulfonamido)-3-methylbutanamide
Type:
Small organic molecule
Emp. Form.:
C17H24FN3O3S
Mol. Mass.:
369.454
SMILES:
CC(C)C[C@H](NC(=O)[C@@H](NS(=O)(=O)c1ccc(F)cc1)C(C)C)C#N
: