Target
Calpain-2 catalytic subunit
Ligand
BDBM50189826
Substrate
Meas. Tech.
ChEMBL_367108 (CHEMBL863672)
IC50
2600±n/a nM
Citation
 Shirasaki, YNakamura, MYamaguchi, MMiyashita, HSakai, OInoue, J Exploration of orally available calpain inhibitors 2: peptidyl hemiacetal derivatives. J Med Chem 49:3926-32 (2006)  
Target
Name:
Calpain-2 catalytic subunit
Synonyms:
3.4.22.53 CANP 2 Calcium-activated neutral proteinase 2 Calpain M-type Calpain-2 large subunit Millimolar-calpain
Type:
Mol. Mass.:
37789.71
Organism:
Sus scrofa
Description:
Residue:
324
  
Inhibitor
Name:
BDBM50189826
Synonyms:
(S)-2-(4-fluorophenylsulfonamido)-N-((3S)-2-hydroxy-tetrahydrofuran-3-yl)-3-methylbutanamide | CHEMBL209736
Type:
Small organic molecule
Emp. Form.:
C15H21FN2O5S
Mol. Mass.:
360.401
SMILES:
CC(C)[C@H](NS(=O)(=O)c1ccc(F)cc1)C(=O)N[C@H]1CCOC1O
: