Target
D(4) dopamine receptor
Ligand
BDBM50193315
Substrate
Meas. Tech.
ChEMBL_382039 (CHEMBL863651)
Ki
134±n/a nM
Citation
 Kolasa, TMatulenko, MAHakeem, AAPatel, MVMortell, KBhatia, PHenry, RNakane, MHsieh, GCTerranova, MAUchic, MEMiller, LNChang, RDonnelly-Roberts, DLNamovic, MTHollingsworth, PRMartino, BEl Kouhen, OMarsh, KCWetter, JMMoreland, RBBrioni, JDStewart, AO 1-aryl-3-(4-pyridine-2-ylpiperazin-1-yl)propan-1-one oximes as potent dopamine D4 receptor agonists for the treatment of erectile dysfunction. J Med Chem 49:5093-109 (2006)  
Target
Name:
D(4) dopamine receptor
Synonyms:
D(2C) dopamine receptor DOPAMINE D4.2 DRD4 Dopamine D4 receptor
Type:
Enzyme
Mol. Mass.:
48373.19
Organism:
Homo sapiens (Human)
Description:
P21917
Residue:
419
  
Inhibitor
Name:
BDBM50193315
Synonyms:
(E)-1-(4-chlorophenyl)-3-(3',4',5',6'-tetrahydro-2'H-[2,4']bipyridinyl-1'-yl)propan-1-one O-methyloxime | CHEMBL210101
Type:
Small organic molecule
Emp. Form.:
C20H24ClN3O
Mol. Mass.:
357.877
SMILES:
CO\N=C(/CCN1CCC(CC1)c1ccccn1)c1ccc(Cl)cc1
: