Target
D(4) dopamine receptor
Ligand
BDBM50193357
Substrate
Meas. Tech.
ChEMBL_382039 (CHEMBL863651)
Ki
20.1±n/a nM
Citation
 Kolasa, TMatulenko, MAHakeem, AAPatel, MVMortell, KBhatia, PHenry, RNakane, MHsieh, GCTerranova, MAUchic, MEMiller, LNChang, RDonnelly-Roberts, DLNamovic, MTHollingsworth, PRMartino, BEl Kouhen, OMarsh, KCWetter, JMMoreland, RBBrioni, JDStewart, AO 1-aryl-3-(4-pyridine-2-ylpiperazin-1-yl)propan-1-one oximes as potent dopamine D4 receptor agonists for the treatment of erectile dysfunction. J Med Chem 49:5093-109 (2006)  
Target
Name:
D(4) dopamine receptor
Synonyms:
D(2C) dopamine receptor DOPAMINE D4.2 DRD4 Dopamine D4 receptor
Type:
Enzyme
Mol. Mass.:
48373.19
Organism:
Homo sapiens (Human)
Description:
P21917
Residue:
419
  
Inhibitor
Name:
BDBM50193357
Synonyms:
(Z)-4-[1-methoxyimino-3-(4-pyridin-2-ylpiperazin-1-yl)propyl]benzonitrile | CHEMBL211836
Type:
Small organic molecule
Emp. Form.:
C20H23N5O
Mol. Mass.:
349.4295
SMILES:
CO\N=C(\CCN1CCN(CC1)c1ccccn1)c1cccc(c1)C#N
: