Target
Sterol O-acyltransferase 1
Ligand
BDBM50175017
Substrate
Meas. Tech.
ChEMBL_424060 (CHEMBL855069)
IC50
20000±n/a nM
Citation
 Park, KHPark, YDHan, JMIm, KRLee, BWJeong, IYJeong, TSLee, WS Anti-atherosclerotic and anti-inflammatory activities of catecholic xanthones and flavonoids isolated from Cudrania tricuspidata. Bioorg Med Chem Lett 16:5580-3 (2006)  
Target
Name:
Sterol O-acyltransferase 1
Synonyms:
ACACT ACAT Acetyl-CoA acetyltransferase, mitochondrial Acyl-CoA: cholesterol acyltransferase (ACAT) Cholesterol acyltransferase 1 SOAT1 STAT
Type:
Multi-pass membrane protein may form homo- or heterodimers.
Mol. Mass.:
64751.94
Organism:
Homo sapiens (Human)
Description:
P35610
Residue:
550
  
Inhibitor
Name:
BDBM50175017
Synonyms:
3,6,8-trihydroxy-2-methoxy-1-(3-methylbut-2-enyl)-5-(2-methylbut-3-en-2-yl)-9H-xanthen-9-one cudraxanthone C
Type:
Small organic molecule
Emp. Form.:
C24H26O6
Mol. Mass.:
410.4596
SMILES:
[#6]-[#8]-c1c(-[#8])cc2oc3c(c(-[#8])cc(-[#8])c3c(=O)c2c1-[#6]\[#6]=[#6](\[#6])-[#6])C([#6])([#6])[#6]=[#6]
: