Target
Acetylcholinesterase
Ligand
BDBM10478
Substrate
Meas. Tech.
ChEMBL_403196 (CHEMBL869256)
IC50
711±n/a nM
Citation
 Rydberg, EHBrumshtein, BGreenblatt, HMWong, DMShaya, DWilliams, LDCarlier, PRPang, YPSilman, ISussman, JL Complexes of alkylene-linked tacrine dimers with Torpedo californica acetylcholinesterase: Binding of Bis5-tacrine produces a dramatic rearrangement in the active-site gorge. J Med Chem 49:5491-500 (2006)  
Target
Name:
Acetylcholinesterase
Synonyms:
ACES_RAT Acetylcholinesterase and butyrylcholinesterase (AChE and BChE) Acetylcholinesterase, AChE | Ache
Type:
Enzyme
Mol. Mass.:
68193.62
Organism:
Rattus norvegicus (rat)
Description:
P37136
Residue:
614
  
Inhibitor
Name:
BDBM10478
Synonyms:
A2A.2HCl CHEMBL213377 | N-[2-(1,2,3,4-tetrahydroacridin-9-ylamino)ethyl]-1,2,3,4-tetrahydroacridin-9-amine dihydrochloride
Type:
Small organic molecule
Emp. Form.:
C28H30N4
Mol. Mass.:
422.5646
SMILES:
C(CNc1c2CCCCc2nc2ccccc12)Nc1c2CCCCc2nc2ccccc12
: