Target
Potassium voltage-gated channel subfamily A member 5
Ligand
BDBM50194519
Substrate
Meas. Tech.
ChEMBL_422064 (CHEMBL907690)
IC50
1773±n/a nM
Citation
 Nanda, KKNolt, MBCato, MJKane, SAKiss, LSpencer, RHWang, JLynch, JJRegan, CPStump, GLLi, BWhite, RYeh, SBogusky, MJBilodeau, MTDinsmore, CJLindsley, CWHartman, GDWolkenberg, SETrotter, BW Potent antagonists of the Kv1.5 potassium channel: synthesis and evaluation of analogous N,N-diisopropyl-2-(pyridine-3-yl)acetamides. Bioorg Med Chem Lett 16:5897-901 (2006)  
Target
Name:
Potassium voltage-gated channel subfamily A member 5
Synonyms:
HK2 KCNA5 Potassium voltage-gated channel subfamily A member 5 Voltage-gated potassium channel subunit Kv1.5
Type:
Enzyme
Mol. Mass.:
67222.47
Organism:
Homo sapiens (Human)
Description:
P22460
Residue:
613
  
Inhibitor
Name:
BDBM50194519
Synonyms:
CHEMBL436956 | methyl 3-(2-cyanophenyl)-5-(diisopropylamino)-5-oxo-4-(pyridin-3-yl)pentanoate
Type:
Small organic molecule
Emp. Form.:
C24H29N3O3
Mol. Mass.:
407.5054
SMILES:
COC(=O)CC(C(C(=O)N(C(C)C)C(C)C)c1cccnc1)c1ccccc1C#N
: