Target
Prothrombin
Ligand
BDBM50194744
Substrate
Meas. Tech.
ChEBML_398435
IC50
6000±n/a nM
Citation
 Joossens, JVan der Veken, PSurpateanu, GLambeir, AMEl-Sayed, IAli, OMAugustyns, KHaemers, A Diphenyl phosphonate inhibitors for the urokinase-type plasminogen activator: optimization of the P4 position. J Med Chem 49:5785-93 (2006)  
Target
Name:
Prothrombin
Synonyms:
Activation peptide fragment 1 Coagulation factor II Prothrombin precursor Thrombin heavy chain | Thrombin light chain
Type:
Protein
Mol. Mass.:
70029.57
Organism:
Homo sapiens (Human)
Description:
P00734
Residue:
622
  
Inhibitor
Name:
BDBM50194744
Synonyms:
CHEMBL385897 | diphenyl 1-[(N-naphthalenesulfonyl-D-seryl)-L-alanyl]amino-2-(4-guanidinophenyl)ethanephosphonate
Type:
Small organic molecule
Emp. Form.:
C37H39N6O8PS
Mol. Mass.:
758.78
SMILES:
[#6]-[#6@H](-[#7]-[#6](=O)-[#6@@H](-[#6]-[#8])-[#7]S(=O)(=O)c1cccc2ccccc12)-[#6](=O)-[#7]-[#6](-[#6]-c1ccc(cc1)\[#7]=[#6](\[#7])-[#7])P(=O)([#8]-c1ccccc1)[#8]-c1ccccc1
: